Reaction Details
TargetHeat shock factor protein 1
LigandBDBM36923
Substrate/Competitorn/a
Meas. Tech.Luminescence Cell-Based Dose Confimation HTS to Identify Inhibitors of Heat Shock Factor 1 (HSF1)
EC50 4309±1022 nM
Citation PubChem, PC Luminescence Cell-Based Dose Confimation HTS to Identify Inhibitors of Heat Shock Factor 1 (HSF1) PubChem Bioassay(2010)[AID]
 
Heat shock factor protein 1
Name:Heat shock factor protein 1
Type:Enzyme Catalytic Domain
Mol. Mass.:57208.68
Organism:Mus musculus
Description:P38532
Residue:525
BDBM36923
NameBDBM36923
Synonyms:(Z)-3,4-bis(benzenesulfonyl)-2-buten-1-ol (Z)-3,4-bis(phenylsulfonyl)but-2-en-1-ol MLS000080860 cid_5389617
TypeSmall organic molecule
Emp. Form.C16H16O5S2
Mol. Mass.352.425
SMILESOC\C=C(\CS(=O)(=O)c1ccccc1)S(=O)(=O)c1ccccc1