Reaction Details
TargetHeat shock factor protein 1
LigandBDBM50640
Substrate/Competitorn/a
Meas. Tech.Luminescence Cell-Based Dose Confimation HTS to Identify Inhibitors of Heat Shock Factor 1 (HSF1)
EC50 5421±1065 nM
Citation PubChem, PC Luminescence Cell-Based Dose Confimation HTS to Identify Inhibitors of Heat Shock Factor 1 (HSF1) PubChem Bioassay(2010)[AID]
 
Heat shock factor protein 1
Name:Heat shock factor protein 1
Type:Enzyme Catalytic Domain
Mol. Mass.:57208.68
Organism:Mus musculus
Description:P38532
Residue:525
BDBM50640
NameBDBM50640
Synonyms:2-chloranyl-3-(1H-indazol-6-ylamino)naphthalene-1,4-dione 2-chloro-3-(1H-indazol-6-ylamino)naphthalene-1,4-dione SMR000528477 | cid_265940
TypeSmall organic molecule
Emp. Form.C17H10ClN3O2
Mol. Mass.323.733
SMILESClC1=C(Nc2ccc3cn[nH]c3c2)C(=O)c2ccccc2C1=O