Reaction Details
TargetHeat shock factor protein 1
LigandBDBM43491
Substrate/Competitorn/a
Meas. Tech.Luminescence Cell-Based Dose Confimation HTS to Identify Inhibitors of Heat Shock Factor 1 (HSF1)
EC50>195000±0 nM
Citation PubChem, PC Luminescence Cell-Based Dose Confimation HTS to Identify Inhibitors of Heat Shock Factor 1 (HSF1) PubChem Bioassay(2010)[AID]
 
Heat shock factor protein 1
Name:Heat shock factor protein 1
Type:Enzyme Catalytic Domain
Mol. Mass.:57208.68
Organism:Mus musculus
Description:P38532
Residue:525
BDBM43491
NameBDBM43491
Synonyms:(3E,5E)-3,5-bis(3,4,5-trimethoxybenzylidene)tetrahydropyran-4-one (3E,5E)-3,5-bis[(3,4,5-trimethoxyphenyl)methylidene]oxan-4-one MLS000860258 cid_5703458
TypeSmall organic molecule
Emp. Form.C25H28O8
Mol. Mass.456.485
SMILESCOc1cc(\C=C2/COC\C(=C/c3cc(OC)c(OC)c(OC)c3)C2=O)cc(OC)c1OC