Reaction Details
TargetHeat shock factor protein 1
LigandBDBM63989
Substrate/Competitorn/a
Meas. Tech.Luminescence Cell-Based Dose Confimation HTS to Identify Inhibitors of Heat Shock Factor 1 (HSF1)
EC50>195000±0 nM
Citation PubChem, PC Luminescence Cell-Based Dose Confimation HTS to Identify Inhibitors of Heat Shock Factor 1 (HSF1) PubChem Bioassay(2010)[AID]
 
Heat shock factor protein 1
Name:Heat shock factor protein 1
Type:Enzyme Catalytic Domain
Mol. Mass.:57208.68
Organism:Mus musculus
Description:P38532
Residue:525
BDBM63989
NameBDBM63989
Synonyms:2-(benzenesulfonyl)-N-(3-chloro-2-methylphenyl)acetamide MLS001184013 SMR000502896 | cid_892315
TypeSmall organic molecule
Emp. Form.C15H14ClNO3S
Mol. Mass.323.795
SMILESCc1c(Cl)cccc1NC(=O)CS(=O)(=O)c1ccccc1