Reaction Details
TargetHeat shock factor protein 1
LigandBDBM48027
Substrate/Competitorn/a
Meas. Tech.Luminescence Cell-Based Dose Confimation HTS to Identify Inhibitors of Heat Shock Factor 1 (HSF1)
EC50 6726±1063 nM
Citation PubChem, PC Luminescence Cell-Based Dose Confimation HTS to Identify Inhibitors of Heat Shock Factor 1 (HSF1) PubChem Bioassay(2010)[AID]
 
Heat shock factor protein 1
Name:Heat shock factor protein 1
Type:Enzyme Catalytic Domain
Mol. Mass.:57208.68
Organism:Mus musculus
Description:P38532
Residue:525
BDBM48027
NameBDBM48027
Synonyms:4-[[(4E)-1-keto-4-mesitylsulfonylimino-2-naphthyl]amino]benzoic acid 4-[[(4E)-1-oxo-4-(2,4,6-trimethylphenyl)sulfonylimino-2-naphthalenyl]amino]benzoic acid MLS000948031 cid_9609431
TypeSmall organic molecule
Emp. Form.C26H22N2O5S
Mol. Mass.474.528
SMILESCc1cc(C)c(c(C)c1)S(=O)(=O)N=C1C=C(Nc2ccc(cc2)C(O)=O)C(=O)c2ccccc12