Reaction Details
TargetSerine/threonine-protein phosphatase PP1-alpha catalytic subunit
LigandBDBM47968
Substrate/Competitorn/a
Meas. Tech.Counterscreen for inhibitors of PP5: fluorescence-based biochemical high throughput dose response assay for inhibitors of Protein Phosphatase 1 (PP1)
IC50 67047±n/a nM
Citation PubChem, PC Counterscreen for inhibitors of PP5: fluorescence-based biochemical high throughput dose response assay for inhibitors of Protein Phosphatase 1 (PP1) PubChem Bioassay(2010)[AID]
 
Serine/threonine-protein phosphatase PP1-alpha catalytic subunit
Name:Serine/threonine-protein phosphatase PP1-alpha catalytic subunit
Type:PROTEIN
Mol. Mass.:37510.66
Organism:Homo sapiens (Human)
Description:ChEMBL_197827
Residue:330
BDBM47968
NameBDBM47968
Synonyms:MLS000686315 N-[4-[(1-oxidanylidene-4-thiophen-2-ylsulfonylimino-naphthalen-2-yl)amino]phenyl]ethanamide N-[4-[(1-oxo-4-thiophen-2-ylsulfonyliminonaphthalen-2-yl)amino]phenyl]acetamide N-[4-[[1-keto-4-(2-thienylsulfonylimino)-2-naphthyl]amino]phenyl]acetamide cid_3715121
TypeSmall organic molecule
Emp. Form.C22H17N3O4S2
Mol. Mass.451.518
SMILESCC(=O)Nc1ccc(NC2=CC(=NS(=O)(=O)c3cccs3)c3ccccc3C2=O)cc1