Reaction Details
TargetATP-dependent molecular chaperone HSP82
LigandBDBM34358
Substrate/Competitorn/a
Meas. Tech.Luminesence Cell-Based Secondary Assay to Identify Inhibitors of Hsp90
EC50 19876±1345 nM
Citation PubChem, PC Luminesence Cell-Based Secondary Assay to Identify Inhibitors of Hsp90 PubChem Bioassay(2010)[AID]
 
ATP-dependent molecular chaperone HSP82
Name:ATP-dependent molecular chaperone HSP82
Synonyms:heat shock protein 90
Type:Enzyme Catalytic Domain
Mol. Mass.:80784.12
Organism:Candida albicans
Description:gi_994798
Residue:707
BDBM34358
NameBDBM34358
TypeSmall organic molecule
Emp. Form.C25H24N4O5S
Mol. Mass.492.547
SMILESCCN(Cc1ccccc1)S(=O)(=O)c1ccc(cc1)C(=O)Nc1nnc(o1)-c1ccccc1OC