Reaction Details
TargetATP-dependent molecular chaperone HSP82
LigandBDBM34197
Substrate/Competitorn/a
Meas. Tech.Fluorescence Cell-Based Secondary Assay to Identify Inhibitors of Resistant C. albicans Growth in the Presence of Fluconazole
EC50>150000±0 nM
Citation PubChem, PC Fluorescence Cell-Based Secondary Assay to Identify Inhibitors of Resistant C. albicans Growth in the Presence of Fluconazole PubChem Bioassay(2010)[AID]
 
ATP-dependent molecular chaperone HSP82
Name:ATP-dependent molecular chaperone HSP82
Synonyms:heat shock protein 90
Type:Enzyme Catalytic Domain
Mol. Mass.:80784.12
Organism:Candida albicans
Description:gi_994798
Residue:707
BDBM34197
NameBDBM34197
TypeSmall organic molecule
Emp. Form.C20H18N2O3
Mol. Mass.334.3685
SMILESOc1c(C(=O)NCCc2ccccc2)c(=O)c2cccc3CCn1c23