Reaction Details
TargetATP-dependent molecular chaperone HSP82
LigandBDBM34204
Substrate/Competitorn/a
Meas. Tech.Fluorescence Cell-Based Secondary Assay to Identify Inhibitors of Resistant C. albicans Growth in the Presence of Fluconazole
EC50 1720±2107 nM
Citation PubChem, PC Fluorescence Cell-Based Secondary Assay to Identify Inhibitors of Resistant C. albicans Growth in the Presence of Fluconazole PubChem Bioassay(2010)[AID]
 
ATP-dependent molecular chaperone HSP82
Name:ATP-dependent molecular chaperone HSP82
Synonyms:heat shock protein 90
Type:Enzyme Catalytic Domain
Mol. Mass.:80784.12
Organism:Candida albicans
Description:gi_994798
Residue:707
BDBM34204
NameBDBM34204
TypeSmall organic molecule
Emp. Form.C21H23N3O3
Mol. Mass.365.4256
SMILESCCCCCn1c2ccccc2c(O)c(C(=O)NCc2ccncc2)c1=O