Reaction Details
TargetATP-dependent molecular chaperone HSP82
LigandBDBM64541
Substrate/Competitorn/a
Meas. Tech.Fluorescence Cell-Based Secondary Assay to Identify Inhibitors of Resistant C. albicans Growth in the Presence of Fluconazole
EC50 896±1160 nM
Citation PubChem, PC Fluorescence Cell-Based Secondary Assay to Identify Inhibitors of Resistant C. albicans Growth in the Presence of Fluconazole PubChem Bioassay(2010)[AID]
 
ATP-dependent molecular chaperone HSP82
Name:ATP-dependent molecular chaperone HSP82
Synonyms:heat shock protein 90
Type:Enzyme Catalytic Domain
Mol. Mass.:80784.12
Organism:Candida albicans
Description:gi_994798
Residue:707
BDBM64541
NameBDBM64541
TypeSmall organic molecule
Emp. Form.C20H23N5
Mol. Mass.333.4301
SMILESCN(C)CCNc1c(CC=C)c(C)c(C#N)c2nc3ccccc3n12