Reaction Details
TargetATP-dependent molecular chaperone HSP82
LigandBDBM38931
Substrate/Competitorn/a
Meas. Tech.Fluorescence Cell-Based Secondary Assay to Identify Inhibitors of Resistant C. albicans Growth in the Presence of Fluconazole
EC50<120±0 nM
Citation PubChem, PC Fluorescence Cell-Based Secondary Assay to Identify Inhibitors of Resistant C. albicans Growth in the Presence of Fluconazole PubChem Bioassay(2010)[AID]
 
ATP-dependent molecular chaperone HSP82
Name:ATP-dependent molecular chaperone HSP82
Synonyms:heat shock protein 90
Type:Enzyme Catalytic Domain
Mol. Mass.:80784.12
Organism:Candida albicans
Description:gi_994798
Residue:707
BDBM38931
NameBDBM38931
TypeSmall organic molecule
Emp. Form.C16H17N5O
Mol. Mass.295.3391
SMILESCc1cc(Nc2ccc(C)cc2)n(n1)-c1nc(C)cc(=O)[nH]1