Reaction Details
TargetATP-dependent molecular chaperone HSP82
LigandBDBM64546
Substrate/Competitorn/a
Meas. Tech.Fluorescence Cell-Based Secondary Assay to Identify Inhibitors of Resistant C. albicans Growth in the Presence of Fluconazole
EC50 703±1206 nM
Citation PubChem, PC Fluorescence Cell-Based Secondary Assay to Identify Inhibitors of Resistant C. albicans Growth in the Presence of Fluconazole PubChem Bioassay(2010)[AID]
 
ATP-dependent molecular chaperone HSP82
Name:ATP-dependent molecular chaperone HSP82
Synonyms:heat shock protein 90
Type:Enzyme Catalytic Domain
Mol. Mass.:80784.12
Organism:Candida albicans
Description:gi_994798
Residue:707
BDBM64546
NameBDBM64546
TypeSmall organic molecule
Emp. Form.C15H13N5OS3
Mol. Mass.375.492
SMILESCCn1c(Sc2nc(C)nc3scc(-c4cccs4)c23)n[nH]c1=O