Reaction Details
TargetATP-dependent molecular chaperone HSP82
LigandBDBM64922
Substrate/Competitorn/a
Meas. Tech.Fluorescence Cell-Based Secondary Assay to Identify Inhibitors of Resistant C. albicans Growth in the Presence of Fluconazole
EC50 866±1291 nM
Citation PubChem, PC Fluorescence Cell-Based Secondary Assay to Identify Inhibitors of Resistant C. albicans Growth in the Presence of Fluconazole PubChem Bioassay(2010)[AID]
 
ATP-dependent molecular chaperone HSP82
Name:ATP-dependent molecular chaperone HSP82
Synonyms:heat shock protein 90
Type:Enzyme Catalytic Domain
Mol. Mass.:80784.12
Organism:Candida albicans
Description:gi_994798
Residue:707
BDBM64922
NameBDBM64922
TypeSmall organic molecule
Emp. Form.C13H12N2O4S2
Mol. Mass.324.375
SMILESCc1ccsc1C(=O)OCC(=O)Nc1sccc1C(N)=O