Reaction Details
TargetATP-dependent molecular chaperone HSP82
LigandBDBM64923
Substrate/Competitorn/a
Meas. Tech.Fluorescence Cell-Based Secondary Assay to Identify Inhibitors of Resistant C. albicans Growth in the Presence of Fluconazole
EC50 421±2671 nM
Citation PubChem, PC Fluorescence Cell-Based Secondary Assay to Identify Inhibitors of Resistant C. albicans Growth in the Presence of Fluconazole PubChem Bioassay(2010)[AID]
 
ATP-dependent molecular chaperone HSP82
Name:ATP-dependent molecular chaperone HSP82
Synonyms:heat shock protein 90
Type:Enzyme Catalytic Domain
Mol. Mass.:80784.12
Organism:Candida albicans
Description:gi_994798
Residue:707
BDBM64923
NameBDBM64923
TypeSmall organic molecule
Emp. Form.C18H15N5O3
Mol. Mass.349.3434
SMILESCc1nn(c(C)c1C(=O)Nc1nnc(o1)-c1ccco1)-c1ccccc1