Reaction Details
TargetATP-dependent molecular chaperone HSP82
LigandBDBM38979
Substrate/Competitorn/a
Meas. Tech.Fluorescence Cell-Based Secondary Assay to Identify Inhibitors of Resistant C. albicans Growth in the Presence of Fluconazole
EC50 963±1486 nM
Citation PubChem, PC Fluorescence Cell-Based Secondary Assay to Identify Inhibitors of Resistant C. albicans Growth in the Presence of Fluconazole PubChem Bioassay(2010)[AID]
 
ATP-dependent molecular chaperone HSP82
Name:ATP-dependent molecular chaperone HSP82
Synonyms:heat shock protein 90
Type:Enzyme Catalytic Domain
Mol. Mass.:80784.12
Organism:Candida albicans
Description:gi_994798
Residue:707
BDBM38979
NameBDBM38979
TypeSmall organic molecule
Emp. Form.C22H24N2O3
Mol. Mass.364.4376
SMILESOc1c(CN2CCOCC2)cc(COCc2ccccc2)c2cccnc12