Reaction Details
TargetDelta-type opioid receptor
LigandBDBM65817
Substrate/Competitorn/a
Meas. Tech.SAR Analysis of Agonists of the DOR Receptor using an Image-Based Assay - Set 2
EC50>32000±n/a nM
Citation PubChem, PC SAR Analysis of Agonists of the DOR Receptor using an Image-Based Assay - Set 2 PubChem Bioassay(2010)[AID]
 
Delta-type opioid receptor
Name:Delta-type opioid receptor
Type:G Protein-Coupled Receptor (GPCR)
Mol. Mass.:40382.98
Organism:Homo sapiens (Human)
Description:Competition binding assays were carried out using membrane preparations from transfected HN9.10 cells that constitutively expressed the delta opioid receptor.
Residue:372
BDBM65817
NameBDBM65817
Synonyms:2-[5-[(3,4-dichlorobenzyl)thio]-4-(2-furfuryl)-1,2,4-triazol-3-yl]pyridine 2-[5-[(3,4-dichlorophenyl)methylthio]-4-(2-furanylmethyl)-1,2,4-triazol-3-yl]pyridine KUC103893N cid_44601470
TypeSmall organic molecule
Emp. Form.C19H14Cl2N4OS
Mol. Mass.417.312
SMILESClc1ccc(CSc2nnc(-c3ccccn3)n2Cc2ccco2)cc1Cl