Reaction Details
TargetKappa-type opioid receptor
LigandBDBM65817
Substrate/Competitorn/a
Meas. Tech.SAR analysis of Agonists of the Kappa Opioid Receptor (KOR) using an Image-Based Assay - Set 2
EC50 347±n/a nM
Citation PubChem, PC SAR analysis of Agonists of the Kappa Opioid Receptor (KOR) using an Image-Based Assay - Set 2 PubChem Bioassay(2010)[AID]
 
Kappa-type opioid receptor
Name:Kappa-type opioid receptor
Type:G Protein-Coupled Receptor (GPCR)
Mol. Mass.:42648.76
Organism:Homo sapiens (Human)
Description:P41145
Residue:380
BDBM65817
NameBDBM65817
Synonyms:2-[5-[(3,4-dichlorobenzyl)thio]-4-(2-furfuryl)-1,2,4-triazol-3-yl]pyridine 2-[5-[(3,4-dichlorophenyl)methylthio]-4-(2-furanylmethyl)-1,2,4-triazol-3-yl]pyridine KUC103893N cid_44601470
TypeSmall organic molecule
Emp. Form.C19H14Cl2N4OS
Mol. Mass.417.312
SMILESClc1ccc(CSc2nnc(-c3ccccn3)n2Cc2ccco2)cc1Cl