Reaction Details
TargetGlucose-6-phosphate 1-dehydrogenase
LigandBDBM46667
Substrate/Competitorn/a
Meas. Tech.G6DPH counterscreen for TbHK1 inhibitors - Analogues series
IC50>25000±n/a nM
Citation PubChem, PC G6DPH counterscreen for TbHK1 inhibitors - Analogues series PubChem Bioassay(2010)[AID]
 
Glucose-6-phosphate 1-dehydrogenase
Name:Glucose-6-phosphate 1-dehydrogenase
Type:Enzyme Catalytic Domain
Mol. Mass.:54421.26
Organism:Leuconostoc mesenteroides
Description:gi_149631
Residue:486
BDBM46667
NameBDBM46667
Synonyms:2-phenyl-1,2-benzothiazol-3-one MLS-0107957.0001 cid_164981
TypeSmall organic molecule
Emp. Form.C13H9NOS
Mol. Mass.227.282
SMILESO=c1n(sc2ccccc12)-c1ccccc1