Reaction Details
TargetInward rectifier potassium channel 2
LigandBDBM65858
Substrate/Competitorn/a
Meas. Tech.Confirmation dose response assay for compounds that inhibit/block inward-rectifying potassium ion channel Kir2.1
IC50 15762±10996 nM
Citation PubChem, PC Confirmation dose response assay for compounds that inhibit/block inward-rectifying potassium ion channel Kir2.1 PubChem Bioassay(2010)[AID]
 
Inward rectifier potassium channel 2
Name:Inward rectifier potassium channel 2
Type:Enzyme Catalytic Domain
Mol. Mass.:48383.35
Organism:Mus musculus
Description:gi_6680530
Residue:428
BDBM65858
NameBDBM65858
Synonyms:MLS000557943 N-[2-[5-[(4-chlorophenyl)methylthio]-1,3,4-oxadiazol-2-yl]ethyl]carbamic acid tert-butyl ester cid_1973366 {2-[5-(4-Chloro-benzylsulfanyl)-[1,3,4]oxadiazol-2-yl]-ethyl}-carbamic acid tert-butyl ester
TypeSmall organic molecule
Emp. Form.C16H20ClN3O3S
Mol. Mass.369.866
SMILESCC(C)(C)OC(=O)NCCc1nnc(SCc2ccc(Cl)cc2)o1