Reaction Details
TargetTyrosine-protein phosphatase non-receptor type 22
LigandBDBM46240
Substrate/Competitorn/a
Meas. Tech.SAR LYP1 Fluorescent Assay using pCAP substrate for In Vitro dose response studies - Set 2
IC50 10800±n/a nM
Citation PubChem, PC SAR LYP1 Fluorescent Assay using pCAP substrate for In Vitro dose response studies - Set 2 PubChem Bioassay(2010)[AID]
 
Tyrosine-protein phosphatase non-receptor type 22
Name:Tyrosine-protein phosphatase non-receptor type 22
Type:n/a
Mol. Mass.:91712.31
Organism:Homo sapiens (Human)
Description:Q9Y2R2
Residue:807
BDBM46240
NameBDBM46240
Synonyms:4-[(E)-2-[3-bromanyl-4-[(4-fluorophenyl)methoxy]phenyl]-1-cyano-ethenyl]benzoic acid 4-[(E)-2-[3-bromo-4-[(4-fluorophenyl)methoxy]phenyl]-1-cyanoethenyl]benzoic acid cid_2240797
TypeSmall organic molecule
Emp. Form.C23H15BrFNO3
Mol. Mass.452.273
SMILESOC(=O)c1ccc(cc1)C(=C/c1ccc(OCc2ccc(F)cc2)c(Br)c1)\C#N