Reaction Details
TargetTyrosine-protein phosphatase non-receptor type 22
LigandBDBM46243
Substrate/Competitorn/a
Meas. Tech.SAR LYP1 Fluorescent Assay using pCAP substrate for In Vitro dose response studies - Set 2
IC50 36100±n/a nM
Citation PubChem, PC SAR LYP1 Fluorescent Assay using pCAP substrate for In Vitro dose response studies - Set 2 PubChem Bioassay(2010)[AID]
 
Tyrosine-protein phosphatase non-receptor type 22
Name:Tyrosine-protein phosphatase non-receptor type 22
Type:n/a
Mol. Mass.:91712.31
Organism:Homo sapiens (Human)
Description:Q9Y2R2
Residue:807
BDBM46243
NameBDBM46243
Synonyms:4-[[2-chloranyl-4-[(E)-2-cyano-2-(3-fluorophenyl)ethenyl]-6-ethoxy-phenoxy]methyl]benzoic acid 4-[[2-chloro-4-[(E)-2-cyano-2-(3-fluorophenyl)vinyl]-6-ethoxy-phenoxy]methyl]benzoic acid cid_2230267
TypeSmall organic molecule
Emp. Form.C25H19ClFNO4
Mol. Mass.451.874
SMILESCCOc1cc(\C=C(\C#N)c2cccc(F)c2)cc(Cl)c1OCc1ccc(cc1)C(O)=O