Reaction Details
Target60S ribosomal protein L19-A
LigandBDBM65982
Substrate/Competitorn/a
Meas. Tech.Dose Response of TOR pathway GFP-fusion proteins in Saccharomyes cerevisiae specifically RPL19A based on MLPCN hits
EC50 3886±n/a nM
Citation PubChem, PC Dose Response of TOR pathway GFP-fusion proteins in Saccharomyes cerevisiae specifically RPL19A based on MLPCN hits PubChem Bioassay(2010)[AID]
 
60S ribosomal protein L19-A
Name:60S ribosomal protein L19-A
Type:Enzyme Catalytic Domain
Mol. Mass.:21739.62
Organism:Saccharomyces cerevisiae
Description:gi_536029
Residue:189
BDBM65982
NameBDBM65982
Synonyms:2-phenyl-4-quinolinecarboxylic acid [2-[4-[2-furanyl(oxo)methyl]-1-piperazinyl]-2-oxoethyl] ester MLS000082215 [2-[4-(furan-2-carbonyl)piperazin-1-yl]-2-oxoethyl] 2-phenylquinoline-4-carboxylate cid_2366734
TypeSmall organic molecule
Emp. Form.C27H23N3O5
Mol. Mass.469.4886
SMILESO=C(COC(=O)c1cc(nc2ccccc12)-c1ccccc1)N1CCN(CC1)C(=O)c1ccco1