Reaction Details
Target60S ribosomal protein L19-A
LigandBDBM31068
Substrate/Competitorn/a
Meas. Tech.Dose Response of TOR pathway GFP-fusion proteins in Saccharomyes cerevisiae specifically RPL19A based on MLPCN hits
EC50>33000±n/a nM
Citation PubChem, PC Dose Response of TOR pathway GFP-fusion proteins in Saccharomyes cerevisiae specifically RPL19A based on MLPCN hits PubChem Bioassay(2010)[AID]
 
60S ribosomal protein L19-A
Name:60S ribosomal protein L19-A
Type:Enzyme Catalytic Domain
Mol. Mass.:21739.62
Organism:Saccharomyces cerevisiae
Description:gi_536029
Residue:189
BDBM31068
NameBDBM31068
Synonyms:2-(methylsulfonyl)-4-thien-2-yl-6-(trifluoromethyl)pyrimidine 2-methylsulfonyl-4-thiophen-2-yl-6-(trifluoromethyl)pyrimidine SMR000022589 cid_3245258
TypeSmall organic molecule
Emp. Form.C10H7F3N2O2S2
Mol. Mass.308.3
SMILESCS(=O)(=O)c1nc(cc(n1)C(F)(F)F)-c1cccs1