Reaction Details
Target60S ribosomal protein L19-A
LigandBDBM33150
Substrate/Competitorn/a
Meas. Tech.Dose Response of TOR pathway GFP-fusion proteins in Saccharomyes cerevisiae specifically RPL19A based on MLPCN hits
EC50 11270±n/a nM
Citation PubChem, PC Dose Response of TOR pathway GFP-fusion proteins in Saccharomyes cerevisiae specifically RPL19A based on MLPCN hits PubChem Bioassay(2010)[AID]
 
60S ribosomal protein L19-A
Name:60S ribosomal protein L19-A
Type:Enzyme Catalytic Domain
Mol. Mass.:21739.62
Organism:Saccharomyces cerevisiae
Description:gi_536029
Residue:189
BDBM33150
NameBDBM33150
Synonyms:3-[(E)-3-(2,4-dimethylphenyl)-1-oxoprop-2-enyl]-2-hydroxy-1-cyclohepta-2,4,6-trienone 3-[(E)-3-(2,4-dimethylphenyl)prop-2-enoyl]-2-hydroxycyclohepta-2,4,6-trien-1-one 3-[3-(2,4-dimethylphenyl)acryloyl]-2-hydroxy-2,4,6-cycloheptatrien-1-one SMR000229842 | cid_7314606
TypeSmall organic molecule
Emp. Form.C18H16O3
Mol. Mass.280.3178
SMILESCc1ccc(\C=C\C(=O)c2ccccc(=O)c2O)c(C)c1