Reaction Details
TargetCitrate synthase, peroxisomal [1-24]
LigandBDBM66029
Substrate/Competitorn/a
Meas. Tech.Dose Response of TOR pathway GFP-fusion proteins in Saccharomyes cerevisiae specifically CIT2 based on MLPCN hits
EC50 1350±n/a nM
Citation PubChem, PC Dose Response of TOR pathway GFP-fusion proteins in Saccharomyes cerevisiae specifically CIT2 based on MLPCN hits PubChem Bioassay(2010)[AID]
 
Citrate synthase, peroxisomal [1-24]
Name:Citrate synthase, peroxisomal [1-24]
Type:Enzyme Catalytic Domain
Mol. Mass.:2731.97
Organism:Saccharomyces cerevisiae
Description:gi_171229
Residue:24
BDBM66029
NameBDBM66029
Synonyms:1-naphthalenecarboxylic acid [(Z)-[1-amino-2-(4-chlorophenyl)ethylidene]amino] ester SMR000149895 [(Z)-[1-azanyl-2-(4-chlorophenyl)ethylidene]amino] naphthalene-1-carboxylate naphthalene-1-carboxylic acid [(Z)-[1-amino-2-(4-chlorophenyl)ethylidene]amino] ester
TypeSmall organic molecule
Emp. Form.C19H15ClN2O2
Mol. Mass.338.788
SMILESNC(Cc1ccc(Cl)cc1)=NOC(=O)c1cccc2ccccc12