Reaction Details
TargetCitrate synthase, peroxisomal [1-24]
LigandBDBM66032
Substrate/Competitorn/a
Meas. Tech.Dose Response of TOR pathway GFP-fusion proteins in Saccharomyes cerevisiae specifically CIT2 based on MLPCN hits
EC50 4160±n/a nM
Citation PubChem, PC Dose Response of TOR pathway GFP-fusion proteins in Saccharomyes cerevisiae specifically CIT2 based on MLPCN hits PubChem Bioassay(2010)[AID]
 
Citrate synthase, peroxisomal [1-24]
Name:Citrate synthase, peroxisomal [1-24]
Type:Enzyme Catalytic Domain
Mol. Mass.:2731.97
Organism:Saccharomyces cerevisiae
Description:gi_171229
Residue:24
BDBM66032
NameBDBM66032
Synonyms:2,4-dichlorobenzoic acid [(Z)-[amino(phenyl)methylene]amino] ester MLS000576961 SMR000185439 [(Z)-[azanyl(phenyl)methylidene]amino] 2,4-bis(chloranyl)benzoate | cid_5332708
TypeSmall organic molecule
Emp. Form.C14H10Cl2N2O2
Mol. Mass.309.147
SMILESNC(=NOC(=O)c1ccc(Cl)cc1Cl)c1ccccc1