Reaction Details
TargetVacuolar aminopeptidase 1
LigandBDBM31045
Substrate/Competitorn/a
Meas. Tech.Dose Response of TOR pathway GFP-fusion proteins in Saccharomyes cerevisiae specifically LAP4 based on MLPCN hits
EC50 450±n/a nM
Citation PubChem, PC Dose Response of TOR pathway GFP-fusion proteins in Saccharomyes cerevisiae specifically LAP4 based on MLPCN hits PubChem Bioassay(2010)[AID]
 
Vacuolar aminopeptidase 1
Name:Vacuolar aminopeptidase 1
Type:Enzyme Catalytic Domain
Mol. Mass.:57084.90
Organism:Saccharomyces cerevisiae
Description:gi_486173
Residue:514
BDBM31045
NameBDBM31045
Synonyms:1-Ethyl-4-hydroxy-2-oxo-1,2-dihydro-quinoline-3-carboxylic acid (1H-benzoimidazol-2-yl)-amide N-(1H-benzimidazol-2-yl)-1-ethyl-2-hydroxy-4-keto-quinoline-3-carboxamide N-(1H-benzimidazol-2-yl)-1-ethyl-2-hydroxy-4-oxoquinoline-3-carboxamide N-(1H-benzimidazol-2-yl)-1-ethyl-4-hydroxy-2-keto-quinoline-3-carboxamide cid_654742
TypeSmall organic molecule
Emp. Form.C19H16N4O3
Mol. Mass.348.3553
SMILESCCn1c2ccccc2c(O)c(C(=O)Nc2nc3ccccc3[nH]2)c1=O