Reaction Details
TargetVacuolar aminopeptidase 1
LigandBDBM66036
Substrate/Competitorn/a
Meas. Tech.Dose Response of TOR pathway GFP-fusion proteins in Saccharomyes cerevisiae specifically LAP4 based on MLPCN hits
EC50 7670±n/a nM
Citation PubChem, PC Dose Response of TOR pathway GFP-fusion proteins in Saccharomyes cerevisiae specifically LAP4 based on MLPCN hits PubChem Bioassay(2010)[AID]
 
Vacuolar aminopeptidase 1
Name:Vacuolar aminopeptidase 1
Type:Enzyme Catalytic Domain
Mol. Mass.:57084.90
Organism:Saccharomyces cerevisiae
Description:gi_486173
Residue:514
BDBM66036
NameBDBM66036
Synonyms:MLS000054763 N-(oxolan-2-ylmethyl)-2-(trifluoromethylsulfonyl)-N-[2-(trifluoromethylsulfonyl)ethyl]ethanamine cid_2998156 | tetrahydrofurfuryl-bis(2-triflylethyl)amine
TypeSmall organic molecule
Emp. Form.C11H17F6NO5S2
Mol. Mass.421.377
SMILESFC(F)(F)S(=O)(=O)CCN(CCS(=O)(=O)C(F)(F)F)CC1CCCO1