Reaction Details
TargetVacuolar aminopeptidase 1
LigandBDBM61009
Substrate/Competitorn/a
Meas. Tech.Dose Response of TOR pathway GFP-fusion proteins in Saccharomyes cerevisiae specifically LAP4 based on MLPCN hits
EC50 865±n/a nM
Citation PubChem, PC Dose Response of TOR pathway GFP-fusion proteins in Saccharomyes cerevisiae specifically LAP4 based on MLPCN hits PubChem Bioassay(2010)[AID]
 
Vacuolar aminopeptidase 1
Name:Vacuolar aminopeptidase 1
Type:Enzyme Catalytic Domain
Mol. Mass.:57084.90
Organism:Saccharomyces cerevisiae
Description:gi_486173
Residue:514
BDBM61009
NameBDBM61009
Synonyms:(1aS,3aS,6aS,6bR)-5,5,6b-trimethyl-3a,4,6,6a-tetrahydro-1H-cycloprop[e]indene-1a,2-dicarbaldehyde (1aS,3aS,6aS,6bR)-5,5,6b-trimethyl-3a,4,6,6a-tetrahydro-1H-cyclopropa[e]indene-1a,2-dicarboxaldehyde Isovelleral SMR000127505 marasmane
TypeSmall organic molecule
Emp. Form.C15H20O2
Mol. Mass.232.3181
SMILESC[C@]12C[C@@]1(C=O)C(C=O)=C[C@@H]1CC(C)(C)C[C@H]21