Reaction Details
TargetVacuolar aminopeptidase 1
LigandBDBM64560
Substrate/Competitorn/a
Meas. Tech.Dose Response of TOR pathway GFP-fusion proteins in Saccharomyes cerevisiae specifically LAP4 based on MLPCN hits
EC50 2455±n/a nM
Citation PubChem, PC Dose Response of TOR pathway GFP-fusion proteins in Saccharomyes cerevisiae specifically LAP4 based on MLPCN hits PubChem Bioassay(2010)[AID]
 
Vacuolar aminopeptidase 1
Name:Vacuolar aminopeptidase 1
Type:Enzyme Catalytic Domain
Mol. Mass.:57084.90
Organism:Saccharomyces cerevisiae
Description:gi_486173
Residue:514
BDBM64560
NameBDBM64560
Synonyms:(5,7-dichloroquinolin-8-yl) furan-2-carboxylate Furan-2-carboxylic acid 5,7-dichloro-quinolin-8-yl ester SMR000116952 cid_686057 | furan-2-carboxylic acid (5,7-dichloro-8-quinolyl) ester
TypeSmall organic molecule
Emp. Form.C14H7Cl2NO3
Mol. Mass.308.116
SMILESClc1cc(Cl)c2cccnc2c1OC(=O)c1ccco1