Reaction Details
TargetVacuolar aminopeptidase 1
LigandBDBM34672
Substrate/Competitorn/a
Meas. Tech.Dose Response of TOR pathway GFP-fusion proteins in Saccharomyes cerevisiae specifically LAP4 based on MLPCN hits
EC50 19280±n/a nM
Citation PubChem, PC Dose Response of TOR pathway GFP-fusion proteins in Saccharomyes cerevisiae specifically LAP4 based on MLPCN hits PubChem Bioassay(2010)[AID]
 
Vacuolar aminopeptidase 1
Name:Vacuolar aminopeptidase 1
Type:Enzyme Catalytic Domain
Mol. Mass.:57084.90
Organism:Saccharomyces cerevisiae
Description:gi_486173
Residue:514
BDBM34672
NameBDBM34672
Synonyms:(4-chlorodithiazol-5-ylidene)-(4-chlorophenyl)amine 4-chloro-N-(4-chlorophenyl)-5-dithiazolimine MLS000548090 SMR000114199 | cid_691683
TypeSmall organic molecule
Emp. Form.C8H4Cl2N2S2
Mol. Mass.263.167
SMILESClc1nss\c1=N\c1ccc(Cl)cc1