Reaction Details
TargetVacuolar aminopeptidase 1
LigandBDBM66041
Substrate/Competitorn/a
Meas. Tech.Dose Response of TOR pathway GFP-fusion proteins in Saccharomyes cerevisiae specifically LAP4 based on MLPCN hits
EC50 2085±n/a nM
Citation PubChem, PC Dose Response of TOR pathway GFP-fusion proteins in Saccharomyes cerevisiae specifically LAP4 based on MLPCN hits PubChem Bioassay(2010)[AID]
 
Vacuolar aminopeptidase 1
Name:Vacuolar aminopeptidase 1
Type:Enzyme Catalytic Domain
Mol. Mass.:57084.90
Organism:Saccharomyces cerevisiae
Description:gi_486173
Residue:514
BDBM66041
NameBDBM66041
Synonyms:4-[2,2-dicyano-1-(4-methoxyphenyl)ethyl]-5-hydroxy-3-methyl-1H-pyrazole-1-carbothioamide 4-[2,2-dicyano-1-(4-methoxyphenyl)ethyl]-5-methyl-3-oxidanylidene-1H-pyrazole-2-carbothioamide MLS000549545 cid_5196974
TypeSmall organic molecule
Emp. Form.C16H15N5O2S
Mol. Mass.341.388
SMILESCOc1ccc(cc1)C(C(C#N)C#N)c1c(C)[nH]n(C(N)=S)c1=O