Reaction Details
TargetVacuolar aminopeptidase 1
LigandBDBM41593
Substrate/Competitorn/a
Meas. Tech.Dose Response of TOR pathway GFP-fusion proteins in Saccharomyes cerevisiae specifically LAP4 based on MLPCN hits
EC50>33000±n/a nM
Citation PubChem, PC Dose Response of TOR pathway GFP-fusion proteins in Saccharomyes cerevisiae specifically LAP4 based on MLPCN hits PubChem Bioassay(2010)[AID]
 
Vacuolar aminopeptidase 1
Name:Vacuolar aminopeptidase 1
Type:Enzyme Catalytic Domain
Mol. Mass.:57084.90
Organism:Saccharomyces cerevisiae
Description:gi_486173
Residue:514
BDBM41593
NameBDBM41593
Synonyms:(Z)-2,3-bis(chloranyl)-N-(6-methoxypyridin-3-yl)-3-(phenylmethyl)sulfinyl-prop-2-enamide (Z)-3-benzylsulfinyl-2,3-dichloro-N-(6-methoxy-3-pyridyl)acrylamide 3-(benzylsulfinyl)-2,3-dichloro-N-(6-methoxy-3-pyridinyl)acrylamide SMR000125560 | cid_1472216
TypeSmall organic molecule
Emp. Form.C16H14Cl2N2O3S
Mol. Mass.385.265
SMILESCOc1ccc(NC(=O)C(Cl)=C(Cl)S(=O)Cc2ccccc2)cn1