Reaction Details
TargetVacuolar aminopeptidase 1
LigandBDBM66043
Substrate/Competitorn/a
Meas. Tech.Dose Response of TOR pathway GFP-fusion proteins in Saccharomyes cerevisiae specifically LAP4 based on MLPCN hits
EC50 4424±n/a nM
Citation PubChem, PC Dose Response of TOR pathway GFP-fusion proteins in Saccharomyes cerevisiae specifically LAP4 based on MLPCN hits PubChem Bioassay(2010)[AID]
 
Vacuolar aminopeptidase 1
Name:Vacuolar aminopeptidase 1
Type:Enzyme Catalytic Domain
Mol. Mass.:57084.90
Organism:Saccharomyces cerevisiae
Description:gi_486173
Residue:514
BDBM66043
NameBDBM66043
Synonyms:2-hydroxy-3-[(E)-3-(2-hydroxy-3-methoxy-phenyl)acryloyl]-6-methyl-pyran-4-one 2-hydroxy-3-[(E)-3-(2-hydroxy-3-methoxyphenyl)prop-2-enoyl]-6-methylpyran-4-one 4-hydroxy-3-[3-(2-hydroxy-3-methoxyphenyl)acryloyl]-6-methyl-2H-pyran-2-one SMR000135132 | cid_5717503
TypeSmall organic molecule
Emp. Form.C16H14O6
Mol. Mass.302.2788
SMILESCOc1cccc(C=CC(=O)c2c(O)cc(C)oc2=O)c1O