Reaction Details
TargetVacuolar aminopeptidase 1
LigandBDBM65997
Substrate/Competitorn/a
Meas. Tech.Dose Response of TOR pathway GFP-fusion proteins in Saccharomyes cerevisiae specifically LAP4 based on MLPCN hits
EC50 1320±n/a nM
Citation PubChem, PC Dose Response of TOR pathway GFP-fusion proteins in Saccharomyes cerevisiae specifically LAP4 based on MLPCN hits PubChem Bioassay(2010)[AID]
 
Vacuolar aminopeptidase 1
Name:Vacuolar aminopeptidase 1
Type:Enzyme Catalytic Domain
Mol. Mass.:57084.90
Organism:Saccharomyces cerevisiae
Description:gi_486173
Residue:514
BDBM65997
NameBDBM65997
Synonyms:(4Z)-3-methyl-4-[(1-phenyl-3-thiophen-2-yl-4-pyrazolyl)methylidene]-1H-pyrazol-5-one (4Z)-3-methyl-4-[(1-phenyl-3-thiophen-2-ylpyrazol-4-yl)methylidene]-1H-pyrazol-5-one MLS000391933 cid_6001017
TypeSmall organic molecule
Emp. Form.C18H14N4OS
Mol. Mass.334.395
SMILESC=c1[nH][nH]c(=O)c1=Cc1cn(nc1-c1cccs1)-c1ccccc1