Reaction Details
TargetVacuolar aminopeptidase 1
LigandBDBM66062
Substrate/Competitorn/a
Meas. Tech.Dose Response of TOR pathway GFP-fusion proteins in Saccharomyes cerevisiae specifically LAP4 based on MLPCN hits
EC50 863±n/a nM
Citation PubChem, PC Dose Response of TOR pathway GFP-fusion proteins in Saccharomyes cerevisiae specifically LAP4 based on MLPCN hits PubChem Bioassay(2010)[AID]
 
Vacuolar aminopeptidase 1
Name:Vacuolar aminopeptidase 1
Type:Enzyme Catalytic Domain
Mol. Mass.:57084.90
Organism:Saccharomyces cerevisiae
Description:gi_486173
Residue:514
BDBM66062
NameBDBM66062
Synonyms:2-keto-1H-pyridine-3-carboxylic acid [2-[1-(2-fluorophenyl)-2,5-dimethyl-pyrrol-3-yl]-2-keto-ethyl] ester MLS000761195 [2-[1-(2-fluorophenyl)-2,5-dimethyl-pyrrol-3-yl]-2-oxidanylidene-ethyl] 2-oxidanylidene-1H-pyridine-3-carboxylate cid_2472065
TypeSmall organic molecule
Emp. Form.C20H17FN2O4
Mol. Mass.368.3584
SMILESCc1cc(C(=O)COC(=O)c2ccc[nH]c2=O)c(C)n1-c1ccccc1F