Reaction Details
TargetVacuolar aminopeptidase 1
LigandBDBM66013
Substrate/Competitorn/a
Meas. Tech.Dose Response of TOR pathway GFP-fusion proteins in Saccharomyes cerevisiae specifically LAP4 based on MLPCN hits
EC50 1318±n/a nM
Citation PubChem, PC Dose Response of TOR pathway GFP-fusion proteins in Saccharomyes cerevisiae specifically LAP4 based on MLPCN hits PubChem Bioassay(2010)[AID]
 
Vacuolar aminopeptidase 1
Name:Vacuolar aminopeptidase 1
Type:Enzyme Catalytic Domain
Mol. Mass.:57084.90
Organism:Saccharomyces cerevisiae
Description:gi_486173
Residue:514
BDBM66013
NameBDBM66013
Synonyms:(5E)-1-(4-methoxyphenyl)-2-sulfanylidene-5-(thiophen-2-ylmethylidene)-1,3-diazinane-4,6-dione 1-(4-Methoxy-phenyl)-5-[1-thiophen-2-yl-meth-(E)-ylidene]-2-thioxo-dihydro-pyrimidine-4,6-dione SMR000431591 | cid_1602504
TypeSmall organic molecule
Emp. Form.C16H12N2O3S2
Mol. Mass.344.408
SMILESCOc1ccc(cc1)N1C(=S)NC(=O)C(=Cc2cccs2)C1=O