Reaction Details
TargetVacuolar aminopeptidase 1
LigandBDBM63997
Substrate/Competitorn/a
Meas. Tech.Dose Response of TOR pathway GFP-fusion proteins in Saccharomyes cerevisiae specifically LAP4 based on MLPCN hits
EC50 327±n/a nM
Citation PubChem, PC Dose Response of TOR pathway GFP-fusion proteins in Saccharomyes cerevisiae specifically LAP4 based on MLPCN hits PubChem Bioassay(2010)[AID]
 
Vacuolar aminopeptidase 1
Name:Vacuolar aminopeptidase 1
Type:Enzyme Catalytic Domain
Mol. Mass.:57084.90
Organism:Saccharomyces cerevisiae
Description:gi_486173
Residue:514
BDBM63997
NameBDBM63997
Synonyms:(5E)-1-methyl-5-[(3-methyl-2-thienyl)methylene]-2-thioxo-hexahydropyrimidine-4,6-quinone (5E)-1-methyl-5-[(3-methylthiophen-2-yl)methylidene]-2-sulfanylidene-1,3-diazinane-4,6-dione SMR000502699 | cid_5956650
TypeSmall organic molecule
Emp. Form.C11H10N2O2S2
Mol. Mass.266.339
SMILESCN1C(=S)NC(=O)\C(=C/c2sccc2C)C1=O