Reaction Details
TargetPhotoreceptor-specific nuclear receptor
LigandBDBM50739
Substrate/Competitorn/a
Meas. Tech.TR-FRET-based biochemical high throughput dose response assay for agonists of nuclear receptor subfamily 2, group E, member 3 (NR2E3)
IC50 177.89±n/a nM
Citation PubChem, PC TR-FRET-based biochemical high throughput dose response assay for agonists of nuclear receptor subfamily 2, group E, member 3 (NR2E3) PubChem Bioassay(2010)[AID]
 
Photoreceptor-specific nuclear receptor
Name:Photoreceptor-specific nuclear receptor
Type:PROTEIN
Mol. Mass.:44699.83
Organism:Homo sapiens (Human)
Description:ChEMBL_401901
Residue:410
BDBM50739
NameBDBM50739
Synonyms:7-(4-methylphenyl)-5-phenyl-4-pyrido[2,3-d]pyrimidinamine 7-(4-methylphenyl)-5-phenylpyrido[2,3-d]pyrimidin-4-amine SMR000459175 cid_2817166
TypeSmall organic molecule
Emp. Form.C20H16N4
Mol. Mass.312.3678
SMILESCc1ccc(cc1)-c1cc(-c2ccccc2)c2c(N)ncnc2n1