Reaction Details
TargetPhotoreceptor-specific nuclear receptor
LigandBDBM66212
Substrate/Competitorn/a
Meas. Tech.TR-FRET-based biochemical high throughput dose response assay for agonists of nuclear receptor subfamily 2, group E, member 3 (NR2E3)
IC50>39841±n/a nM
Citation PubChem, PC TR-FRET-based biochemical high throughput dose response assay for agonists of nuclear receptor subfamily 2, group E, member 3 (NR2E3) PubChem Bioassay(2010)[AID]
 
Photoreceptor-specific nuclear receptor
Name:Photoreceptor-specific nuclear receptor
Type:PROTEIN
Mol. Mass.:44699.83
Organism:Homo sapiens (Human)
Description:ChEMBL_401901
Residue:410
BDBM66212
NameBDBM66212
Synonyms:3-[(7-methoxy-1-benzofuran-2-yl)carbonyl]-1-(5-methyl-1,2-oxazol-3-yl)-4-oxidanyl-2-thiophen-2-yl-2H-pyrrol-5-one 4-hydroxy-3-(7-methoxy-1-benzofuran-2-carbonyl)-1-(5-methyl-1,2-oxazol-3-yl)-2-thiophen-2-yl-2H-pyrrol-5-one MLS001125423 cid_2964736
TypeSmall organic molecule
Emp. Form.C22H16N2O6S
Mol. Mass.436.437
SMILESCOc1cccc2cc(oc12)C(=O)C1C(N(C(=O)C1=O)c1cc(C)on1)c1cccs1