Reaction Details
TargetIsoform 2 of Nuclear receptor corepressor 2 (TRAC-1)
LigandBDBM66158
Substrate/Competitorn/a
Meas. Tech.Counterscreen for agonists of nuclear receptor subfamily 2, group E, member 3 (NR2E3)
IC50 1924±n/a nM
Citation PubChem, PC Counterscreen for agonists of nuclear receptor subfamily 2, group E, member 3 (NR2E3): TR-FRET-based biochemical high throughput dose response assay to identify agonists of the interaction between peroxisome proliferator-activated receptor gamma (PPARg) and nuclear receptor co-repressor 2 (NCOR2) PubChem Bioassay(2010)[AID]
 
Isoform 2 of Nuclear receptor corepressor 2 (TRAC-1)
Name:Isoform 2 of Nuclear receptor corepressor 2 (TRAC-1)
Type:Enzyme Catalytic Domain
Mol. Mass.:81401.89
Organism:Homo sapiens (Human)
Description:Q9Y618-2 gi_116256445
Residue:766
BDBM66158
NameBDBM66158
Synonyms:5-(6a-Hydroxy-2-oxo-hexahydro-thieno[3,4-d]imidazol-6-yl)-pentanoic acid methyl 5-[(3aS,4R,6aS)-3a-hydroxy-2-oxo-3,4,6,6a-tetrahydro-1H-thieno[3,4-d]imidazol-4-yl]pentanoic acid methyl ester SMR000020549 methyl 5-[(3aS,4R,6aS)-3a-hydroxy-2-oxo-3,4,6,6a-tetrahydro-1H-thieno[3,4-d]imidazol-4-yl]pentanoate | methyl 5-[(3aS,4R,6aS)-3a-oxidanyl-2-oxidanylidene-3,4,6,6a-tetrahydro-1H-thieno[3,4-d]imidazol-4-yl]pentanoate
TypeSmall organic molecule
Emp. Form.C11H18N2O4S
Mol. Mass.274.337
SMILESCOC(=O)CCCC[C@H]1SC[C@H]2NC(=O)N[C@@]12O