Reaction Details
TargetIsoform 2 of Nuclear receptor corepressor 2 (TRAC-1)
LigandBDBM51068
Substrate/Competitorn/a
Meas. Tech.Counterscreen for agonists of nuclear receptor subfamily 2, group E, member 3 (NR2E3)
IC50 55.52±n/a nM
Citation PubChem, PC Counterscreen for agonists of nuclear receptor subfamily 2, group E, member 3 (NR2E3): TR-FRET-based biochemical high throughput dose response assay to identify agonists of the interaction between peroxisome proliferator-activated receptor gamma (PPARg) and nuclear receptor co-repressor 2 (NCOR2) PubChem Bioassay(2010)[AID]
 
Isoform 2 of Nuclear receptor corepressor 2 (TRAC-1)
Name:Isoform 2 of Nuclear receptor corepressor 2 (TRAC-1)
Type:Enzyme Catalytic Domain
Mol. Mass.:81401.89
Organism:Homo sapiens (Human)
Description:Q9Y618-2 gi_116256445
Residue:766
BDBM51068
NameBDBM51068
Synonyms:1-chloro-5-methyl-4-phenyl-cyclopenta[c]quinolizine-2,3-dicarboxylic acid dimethyl ester MLS000700795 cid_1234827 dimethyl 1-chloro-5-methyl-4-phenylcyclopenta[c]quinolizine-2,3-dicarboxylate
TypeSmall organic molecule
Emp. Form.C23H18ClNO4
Mol. Mass.407.846
SMILESCOC(=O)c1c(Cl)c2c(c1C(=O)OC)c(-c1ccccc1)c(C)c1ccccn21