Reaction Details
TargetIsoform 2 of Nuclear receptor corepressor 2 (TRAC-1)
LigandBDBM66179
Substrate/Competitorn/a
Meas. Tech.Counterscreen for agonists of nuclear receptor subfamily 2, group E, member 3 (NR2E3)
IC50 778.32±n/a nM
Citation PubChem, PC Counterscreen for agonists of nuclear receptor subfamily 2, group E, member 3 (NR2E3): TR-FRET-based biochemical high throughput dose response assay to identify agonists of the interaction between peroxisome proliferator-activated receptor gamma (PPARg) and nuclear receptor co-repressor 2 (NCOR2) PubChem Bioassay(2010)[AID]
 
Isoform 2 of Nuclear receptor corepressor 2 (TRAC-1)
Name:Isoform 2 of Nuclear receptor corepressor 2 (TRAC-1)
Type:Enzyme Catalytic Domain
Mol. Mass.:81401.89
Organism:Homo sapiens (Human)
Description:Q9Y618-2 gi_116256445
Residue:766
BDBM66179
NameBDBM66179
Synonyms:4-(4-butoxyphenyl)-5-cyano-2-methyl-N-phenyl-6-sulfanylidene-1H-pyridine-3-carboxamide MLS001011152 cid_2317063
TypeSmall organic molecule
Emp. Form.C24H23N3O2S
Mol. Mass.417.523
SMILESCCCCOc1ccc(cc1)-c1c(C#N)c(=S)[nH]c(C)c1C(=O)Nc1ccccc1