Reaction Details
TargetIsoform 2 of Nuclear receptor corepressor 2 (TRAC-1)
LigandBDBM66183
Substrate/Competitorn/a
Meas. Tech.Counterscreen for agonists of nuclear receptor subfamily 2, group E, member 3 (NR2E3)
IC50 1607±n/a nM
Citation PubChem, PC Counterscreen for agonists of nuclear receptor subfamily 2, group E, member 3 (NR2E3): TR-FRET-based biochemical high throughput dose response assay to identify agonists of the interaction between peroxisome proliferator-activated receptor gamma (PPARg) and nuclear receptor co-repressor 2 (NCOR2) PubChem Bioassay(2010)[AID]
 
Isoform 2 of Nuclear receptor corepressor 2 (TRAC-1)
Name:Isoform 2 of Nuclear receptor corepressor 2 (TRAC-1)
Type:Enzyme Catalytic Domain
Mol. Mass.:81401.89
Organism:Homo sapiens (Human)
Description:Q9Y618-2 gi_116256445
Residue:766
BDBM66183
NameBDBM66183
Synonyms:1-(4,6-dimethyl-2-pyridinyl)-3-(3-methoxyphenyl)thiourea 1-(4,6-dimethylpyridin-2-yl)-3-(3-methoxyphenyl)thiourea N-(4,6-dimethyl-2-pyridinyl)-N'-(3-methoxyphenyl)thiourea cid_2731492
TypeSmall organic molecule
Emp. Form.C15H17N3OS
Mol. Mass.287.38
SMILESCOc1cccc(NC(=S)Nc2cc(C)cc(C)n2)c1