Reaction Details
TargetBcl-2-like protein 11
LigandBDBM61665
Substrate/Competitorn/a
Meas. Tech.Luminescence Cell-Based Dose Retest to Identify Inhibitors of A1 Apoptosis
EC50 4890±n/a nM
Citation PubChem, PC Luminescence Cell-Based Dose Retest to Identify Inhibitors of A1 Apoptosis PubChem Bioassay(2010)[AID]
 
Bcl-2-like protein 11
Name:Bcl-2-like protein 11
Type:PROTEIN
Mol. Mass.:22175.26
Organism:Homo sapiens (Human)
Description:EBI_101325
Residue:198
BDBM61665
NameBDBM61665
Synonyms:3-(4-chlorophenyl)-1-(4-methylanilino)pyrrole-2,5-dione 3-(4-chlorophenyl)-1-(p-toluidino)-3-pyrroline-2,5-quinone MLS000540408 cid_5094315
TypeSmall organic molecule
Emp. Form.C17H13ClN2O2
Mol. Mass.312.75
SMILESCc1ccc(NN2C(=O)C=C(C2=O)c2ccc(Cl)cc2)cc1