Reaction Details
TargetBcl-2-like protein 11
LigandBDBM66361
Substrate/Competitorn/a
Meas. Tech.Luminescence Cell-Based Dose Retest to Identify Inhibitors of A1 Apoptosis
EC50 11020±n/a nM
Citation PubChem, PC Luminescence Cell-Based Dose Retest to Identify Inhibitors of A1 Apoptosis PubChem Bioassay(2010)[AID]
 
Bcl-2-like protein 11
Name:Bcl-2-like protein 11
Type:PROTEIN
Mol. Mass.:22175.26
Organism:Homo sapiens (Human)
Description:EBI_101325
Residue:198
BDBM66361
NameBDBM66361
Synonyms:3-(4-Methoxy-phenyl)-3,4-dihydro-1-oxa-4-aza-dibenzo[c,g]phenanthren-2-one SMR000116460 | cid_2868950
TypeSmall organic molecule
Emp. Form.C27H19NO3
Mol. Mass.405.4447
SMILESCOc1ccc(cc1)C1Nc2ccc3ccccc3c2-c2c1c(=O)oc1ccccc21