Reaction Details
TargetBcl-2-like protein 11
LigandBDBM47574
Substrate/Competitorn/a
Meas. Tech.Luminescence Cell-Based Dose Retest to Identify Inhibitors of A1 Apoptosis
EC50 9164±n/a nM
Citation PubChem, PC Luminescence Cell-Based Dose Retest to Identify Inhibitors of A1 Apoptosis PubChem Bioassay(2010)[AID]
 
Bcl-2-like protein 11
Name:Bcl-2-like protein 11
Type:PROTEIN
Mol. Mass.:22175.26
Organism:Homo sapiens (Human)
Description:EBI_101325
Residue:198
BDBM47574
NameBDBM47574
Synonyms:(5Z)-3-[2-(1H-indol-3-yl)ethyl]-5-[(5-morpholin-4-ylfuran-2-yl)methylidene]-2-phenylimino-1,3-thiazolidin-4-one (5Z)-3-[2-(1H-indol-3-yl)ethyl]-5-[[5-(4-morpholinyl)-2-furanyl]methylidene]-2-phenylimino-4-thiazolidinone MLS000325248 cid_9512005
TypeSmall organic molecule
Emp. Form.C28H26N4O3S
Mol. Mass.498.596
SMILESO=C1N(CCc2c[nH]c3ccccc23)\C(S\C1=C/c1ccc(o1)N1CCOCC1)=N\c1ccccc1