Reaction Details
TargetBcl-2-like protein 11
LigandBDBM66418
Substrate/Competitorn/a
Meas. Tech.Luminescence Cell-Based Dose Retest to Identify Inhibitors of A1 Apoptosis
EC50 4647±n/a nM
Citation PubChem, PC Luminescence Cell-Based Dose Retest to Identify Inhibitors of A1 Apoptosis PubChem Bioassay(2010)[AID]
 
Bcl-2-like protein 11
Name:Bcl-2-like protein 11
Type:PROTEIN
Mol. Mass.:22175.26
Organism:Homo sapiens (Human)
Description:EBI_101325
Residue:198
BDBM66418
NameBDBM66418
Synonyms:(E)-2-cyano-N-(3,5-dimethylphenyl)-3-[1-[2-(2-furanylmethylamino)-2-oxoethyl]-3-indolyl]-2-propenamide (E)-2-cyano-N-(3,5-dimethylphenyl)-3-[1-[2-(furan-2-ylmethylamino)-2-oxidanylidene-ethyl]indol-3-yl]prop-2-enamide 2-Cyano-N-(3,5-dimethyl-phenyl)-3-(1-{[(furan-2-ylmethyl)-carbamoyl]-methyl}-1H-indol-3-yl)-acrylamide SMR000177747 | cid_5446513
TypeSmall organic molecule
Emp. Form.C27H24N4O3
Mol. Mass.452.5045
SMILESCc1cc(C)cc(NC(=O)C(=C\c2cn(CC(=O)NCc3ccco3)c3ccccc23)\C#N)c1