Reaction Details
TargetBcl-2-like protein 11
LigandBDBM66502
Substrate/Competitorn/a
Meas. Tech.Luminescence Cell-Based Dose Retest to Identify Inhibitors of A1 Apoptosis
EC50 8462±n/a nM
Citation PubChem, PC Luminescence Cell-Based Dose Retest to Identify Inhibitors of A1 Apoptosis PubChem Bioassay(2010)[AID]
 
Bcl-2-like protein 11
Name:Bcl-2-like protein 11
Type:PROTEIN
Mol. Mass.:22175.26
Organism:Homo sapiens (Human)
Description:EBI_101325
Residue:198
BDBM66502
NameBDBM66502
Synonyms:(2Z,6E)-4-tert-butyl-2,6-bis(2-pyridinylmethylidene)-1-cyclohexanone (2Z,6E)-4-tert-butyl-2,6-bis(pyridin-2-ylmethylene)cyclohexanone MLS000729946 cid_2059132
TypeSmall organic molecule
Emp. Form.C22H24N2O
Mol. Mass.332.4388
SMILESCC(C)(C)C1C\C(=C\c2ccccn2)C(=O)\C(C1)=C\c1ccccn1