Reaction Details
TargetBcl-2-like protein 11
LigandBDBM66635
Substrate/Competitorn/a
Meas. Tech.Luminescence Cell-Based Dose Retest to Identify Inhibitors of A1 Apoptosis
EC50>350000±n/a nM
Citation PubChem, PC Luminescence Cell-Based Dose Retest to Identify Inhibitors of A1 Apoptosis PubChem Bioassay(2010)[AID]
 
Bcl-2-like protein 11
Name:Bcl-2-like protein 11
Type:PROTEIN
Mol. Mass.:22175.26
Organism:Homo sapiens (Human)
Description:EBI_101325
Residue:198
BDBM66635
NameBDBM66635
Synonyms:MLS000737122 [4-[(2Z)-2-(4-amino-2-methylsulfanyl-6-oxopyrimidin-5-ylidene)hydrazinyl]phenyl]arsonic acid [4-[(2Z)-2-[4-amino-2-(methylthio)-6-oxo-5-pyrimidinylidene]hydrazinyl]phenyl]arsonic acid cid_5992379
TypeSmall organic molecule
Emp. Form.C11H12AsN5O4S
Mol. Mass.385.231
SMILESCSc1nc(N)c(N=Nc2ccc(cc2)[As](O)(O)=O)c(=O)[nH]1